Reaction Details
TargetAdenosine receptor A3
LigandBDBM50004461
Substrate/Competitorn/a
Ki 2.4±n/a nM
CommentsPDSP_2452
Citation Klotz, KNCamaioni, EVolpini, RKachler, SVittori, SCristalli, G 2-Substituted N-ethylcarboxamidoadenosine derivatives as high-affinity agonists at human A3 adenosine receptors. Naunyn Schmiedebergs Arch Pharmacol360:103-8 (1999) 
 
Adenosine receptor A3
Name:Adenosine receptor A3
Type:G Protein-Coupled Receptor (GPCR)
Mol. Mass.:36197.32
Organism:Homo sapiens (Human)
Description:P0DMS8
Residue:318
BDBM50004461
NameBDBM50004461
Synonyms:(2S,3R,5R)-5-[6-amino-2-(hex-1-yn-1-yl)-9H-purin-9-yl]-N-ethyl-3,4-dihydroxyoxolane-2-carboxamide 5-(6-Amino-2-hex-1-ynyl-purin-9-yl)-3,4-dihydroxy-tetrahydro-furan-2-carboxylic acid ethylamide HENECA
TypeSmall organic molecule
Emp. Form.C18H24N6O4
Mol. Mass.388.421
SMILESCCCCC#Cc1nc(N)c2ncn([C@@H]3O[C@@H]([C@H](O)C3O)C(=O)NCC)c2n1