Reaction Details
TargetAdenosine receptor A3
LigandBDBM85523
Substrate/Competitorn/a
Ki 0.75±n/a nM
CommentsPDSP_2455
Citation Klotz, KNCamaioni, EVolpini, RKachler, SVittori, SCristalli, G 2-Substituted N-ethylcarboxamidoadenosine derivatives as high-affinity agonists at human A3 adenosine receptors. Naunyn Schmiedebergs Arch Pharmacol360:103-8 (1999) 
 
Adenosine receptor A3
Name:Adenosine receptor A3
Type:G Protein-Coupled Receptor (GPCR)
Mol. Mass.:36197.32
Organism:Homo sapiens (Human)
Description:P0DMS8
Residue:318
BDBM85523
NameBDBM85523
Synonyms:6S, (S)-PHPNECA
TypeSmall organic molecule
Emp. Form.C21H22N6O5
Mol. Mass.438.4366
SMILESCCNC(=O)C1OC(C(O)C1O)n1cnc2c(N)nc(nc12)C#C[C@H](O)c1ccccc1