Reaction Details
Target5-hydroxytryptamine receptor 2B
LigandBDBM85528
Substrate/Competitorn/a
Ki 0.89±n/a nM
CommentsPDSP_1608
Citation Porter, RHBenwell, KRLamb, HMalcolm, CSAllen, NHRevell, DFAdams, DRSheardown, MJ Functional characterization of agonists at recombinant human 5-HT2A, 5-HT2B and 5-HT2C receptors in CHO-K1 cells. Br J Pharmacol128:13-20 (1999) 
 
5-hydroxytryptamine receptor 2B
Name:5-hydroxytryptamine receptor 2B
Type:G Protein-Coupled Receptor (GPCR)
Mol. Mass.:54312.47
Organism:Homo sapiens (Human)
Description:Receptor binding assays were performed using human clone stably expressed in CHO cells.
Residue:481
BDBM85528
NameBDBM85528
Synonyms:CAS_3045226 Ro 60-0175
TypeSmall organic molecule
Emp. Form.C11H12ClFN2
Mol. Mass.226.678
SMILESCC(N)Cn1ccc2cc(F)c(Cl)cc12