Reaction Details
Target5-hydroxytryptamine receptor 2C
LigandBDBM85532
Substrate/Competitorn/a
Ki 37.15±n/a nM
CommentsPDSP_127
Citation Porter, RHBenwell, KRLamb, HMalcolm, CSAllen, NHRevell, DFAdams, DRSheardown, MJ Functional characterization of agonists at recombinant human 5-HT2A, 5-HT2B and 5-HT2C receptors in CHO-K1 cells. Br J Pharmacol128:13-20 (1999) 
 
5-hydroxytryptamine receptor 2C
Name:5-hydroxytryptamine receptor 2C
Type:G Protein-Coupled Receptor (GPCR)
Mol. Mass.:51836.79
Organism:Homo sapiens (Human)
Description:P28335
Residue:458
BDBM85532
NameBDBM85532
Synonyms:5,6-difluoroindol-methylethylamine
TypeSmall organic molecule
Emp. Form.C11H12F2N2
Mol. Mass.210.2232
SMILESCC(C)(N)n1ccc2cc(F)c(F)cc12