Reaction Details
Target5-hydroxytryptamine receptor 2C
LigandBDBM85530
Substrate/Competitorn/a
Ki 169.82±n/a nM
CommentsPDSP_1353
Citation Porter, RHBenwell, KRLamb, HMalcolm, CSAllen, NHRevell, DFAdams, DRSheardown, MJ Functional characterization of agonists at recombinant human 5-HT2A, 5-HT2B and 5-HT2C receptors in CHO-K1 cells. Br J Pharmacol128:13-20 (1999) 
 
5-hydroxytryptamine receptor 2C
Name:5-hydroxytryptamine receptor 2C
Type:G Protein-Coupled Receptor (GPCR)
Mol. Mass.:51836.79
Organism:Homo sapiens (Human)
Description:P28335
Residue:458
BDBM85530
NameBDBM85530
Synonyms:Nor-d-fenfluramine Norfenfluramine Norfenfluramine (-) | d-Norfenfluramine
TypeSmall organic molecule
Emp. Form.C10H12F3N
Mol. Mass.203.2042
SMILESC[C@H](N)Cc1cccc(c1)C(F)(F)F