Reaction Details
TargetMu-type opioid receptor
LigandBDBM85540
Substrate/Competitorn/a
Ki 1.5±n/a nM
CommentsPDSP_435
Citation Traynor, JRGuo, LCoop, ALewis, JWWoods, JH Ring-constrained orvinols as analogs of buprenorphine: differences in opioid activity related to configuration of C(20) hydroxyl group. J Pharmacol Exp Ther291:1093-9 (1999) Mu-type opioid receptor
Name:Mu-type opioid receptor
Type:Enzyme Catalytic Domain
Mol. Mass.:44431.62
Organism:MOUSE
Description:OPIATE Mu OPRM1 MOUSE::P42866
Residue:398
BDBM85540
NameBDBM85540
Synonyms:BU 96 | BU-96
TypeSmall organic molecule
Emp. Form.C28H35NO4
Mol. Mass.449.5818
SMILESCOC12C=C[C@]3(C4[C@H](O)C(C)(C)CC14)[C@H]1Cc4ccc(O)c5O[C@@H]2[C@]3(CCN1CC1CC1)c45