Reaction Details
Target5-hydroxytryptamine receptor 1B
LigandBDBM50005835
Substrate/Competitorn/a
Ki 25.11±n/a nM
CommentsPDSP_1788
Citation Millan, MJNewman-Tancredi, AAudinot, VCussac, DLejeune, FNicolas, JPCogé, FGalizzi, JPBoutin, JARivet, JMDekeyne, AGobert, A Agonist and antagonist actions of yohimbine as compared to fluparoxan at alpha(2)-adrenergic receptors (AR)s, serotonin (5-HT)(1A), 5-HT(1B), 5-HT(1D) and dopamine D(2) and D(3) receptors. Significance for the modulation of frontocortical monoaminergic transmission and depressive states. Synapse35:79-95 (2000) 
 
5-hydroxytryptamine receptor 1B
Name:5-hydroxytryptamine receptor 1B
Type:G Protein-Coupled Receptor (GPCR)
Mol. Mass.:43579.17
Organism:Homo sapiens (Human)
Description:Receptor binding assays were performed using human clone stably expressed in CHO cells
Residue:390
BDBM50005835
NameBDBM50005835
Synonyms:(3-[2-(dimethylamino)ethyl]-1H-indol-5-yl)-N-methylmethanesulfonamide 1-{3-[2-(dimethylamino)ethyl]-1H-indol-5-yl}-N-methylmethanesulfonamide 3-[2-(dimethylamino)ethyl]-N-methylindole-5-methanesulfonamide SUMATRIPTAN Sumax
TypeSmall organic molecule
Emp. Form.C14H21N3O2S
Mol. Mass.295.4
SMILESCNS(=O)(=O)Cc1ccc2[nH]cc(CCN(C)C)c2c1