Reaction Details
TargetAlpha-2A adrenergic receptor [16-465]
LigandBDBM85595
Substrate/Competitorn/a
Ki 1.25±n/a nM
CommentsPDSP_833
Citation Millan, MJNewman-Tancredi, AAudinot, VCussac, DLejeune, FNicolas, JPCogé, FGalizzi, JPBoutin, JARivet, JMDekeyne, AGobert, A Agonist and antagonist actions of yohimbine as compared to fluparoxan at alpha(2)-adrenergic receptors (AR)s, serotonin (5-HT)(1A), 5-HT(1B), 5-HT(1D) and dopamine D(2) and D(3) receptors. Significance for the modulation of frontocortical monoaminergic transmission and depressive states. Synapse35:79-95 (2000) 
 
Alpha-2A adrenergic receptor [16-465]
Name:Alpha-2A adrenergic receptor [16-465]
Type:G-protein coupled receptor
Mol. Mass.:48961.69
Organism:Rattus norvegicus (rat)
Description:P22909[16-465]
Residue:450
BDBM85595
NameBDBM85595
Synonyms:CAS_105182-45-4 NSC_72036
TypeSmall organic molecule
Emp. Form.C10H10FNO2
Mol. Mass.195.1903
SMILESFc1cccc2OC3CNCC3Oc12