Reaction Details
Target5-hydroxytryptamine receptor 2A
LigandBDBM50005265
Substrate/Competitorn/a
Ki 21±n/a nM
CommentsPDSP_722
Citation Egan, CGrinde, EDupre, ARoth, BLHake, MTeitler, MHerrick-Davis, K Agonist high and low affinity state ratios predict drug intrinsic activity and a revised ternary complex mechanism at serotonin 5-HT(2A) and 5-HT(2C) receptors. Synapse35:144-50 (2000) 
 
5-hydroxytryptamine receptor 2A
Name:5-hydroxytryptamine receptor 2A
Type:undefined
Mol. Mass.:52607.65
Organism:Homo sapiens (Human)
Description:P28223
Residue:471
BDBM50005265
NameBDBM50005265
Synonyms:(+/-)2-(2,5-Dimethoxy-4-methyl-phenyl)-1-methyl-ethylamine (Rec)2-(2,5-Dimethoxy-4-methyl-phenyl)-1-methyl-ethylamine; compound with 2-(2,5-dimethoxy-4-methyl-phenyl)-1-methyl-ethylamine 2-(2,5-Dimethoxy-4-methyl-phenyl)-1-methyl-ethylamine((R)-(-)-DOM) CHEMBL8600 DOM,R(-) | Racemic DOM
TypeSmall organic molecule
Emp. Form.C12H19NO2
Mol. Mass.209.2848
SMILESCOc1cc(CC(C)N)c(OC)cc1C