Reaction Details
Target5-hydroxytryptamine receptor 2A
LigandBDBM50001915
Substrate/Competitorn/a
Ki 74±n/a nM
CommentsPDSP_1168
Citation Egan, CGrinde, EDupre, ARoth, BLHake, MTeitler, MHerrick-Davis, K Agonist high and low affinity state ratios predict drug intrinsic activity and a revised ternary complex mechanism at serotonin 5-HT(2A) and 5-HT(2C) receptors. Synapse35:144-50 (2000) 
 
5-hydroxytryptamine receptor 2A
Name:5-hydroxytryptamine receptor 2A
Type:undefined
Mol. Mass.:52607.65
Organism:Homo sapiens (Human)
Description:P28223
Residue:471
BDBM50001915
NameBDBM50001915
Synonyms:1-(3-chlorophenyl)piperazine m-Chlorophenylpiperazine | mCPP
TypeSmall organic molecule
Emp. Form.C10H13ClN2
Mol. Mass.196.677
SMILESClc1cccc(c1)N1CCNCC1