Reaction Details
Target5-hydroxytryptamine receptor 2C
LigandBDBM10755
Substrate/Competitorn/a
Ki 159±n/a nM
CommentsPDSP_150
Citation Egan, CGrinde, EDupre, ARoth, BLHake, MTeitler, MHerrick-Davis, K Agonist high and low affinity state ratios predict drug intrinsic activity and a revised ternary complex mechanism at serotonin 5-HT(2A) and 5-HT(2C) receptors. Synapse35:144-50 (2000) 
 
5-hydroxytryptamine receptor 2C
Name:5-hydroxytryptamine receptor 2C
Type:Enzyme
Mol. Mass.:51935.10
Organism:Rattus norvegicus (Rat)
Description:P08909
Residue:460
BDBM10755
NameBDBM10755
Synonyms:14C-5-hydroxy tryptamine creatinine disulfate 5-HT 5-hydroxy tryptamine creatinine disulfate Serotonin | [3H]-5-HT
TypeSmall organic molecule
Emp. Form.C10H12N2O
Mol. Mass.176.2151
SMILESNCCc1c[nH]c2ccc(O)cc12