Reaction Details
Target5-hydroxytryptamine receptor 2A
LigandBDBM85597
Substrate/Competitorn/a
Ki 1430±n/a nM
CommentsPDSP_1074
Citation Fitzgerald, LWBurn, TCBrown, BSPatterson, JPCorjay, MHValentine, PASun, JHLink, JRAbbaszade, IHollis, JMLargent, BLHartig, PRHollis, GFMeunier, PCRobichaud, AJRobertson, DW Possible role of valvular serotonin 5-HT(2B) receptors in the cardiopathy associated with fenfluramine. Mol Pharmacol57:75-81 (2000) 5-hydroxytryptamine receptor 2A
Name:5-hydroxytryptamine receptor 2A
Type:undefined
Mol. Mass.:52607.65
Organism:Homo sapiens (Human)
Description:P28223
Residue:471
BDBM85597
NameBDBM85597
Synonyms:CAS_37577-24-5 l-Fenfluramine
TypeSmall organic molecule
Emp. Form.C12H16F3N
Mol. Mass.231.2573
SMILESCCN[C@H](C)Cc1cccc(c1)C(F)(F)F