Reaction Details
Target5-hydroxytryptamine receptor 2B
LigandBDBM85598
Substrate/Competitorn/a
Ki 65±n/a nM
CommentsPDSP_1084
Citation Fitzgerald, LWBurn, TCBrown, BSPatterson, JPCorjay, MHValentine, PASun, JHLink, JRAbbaszade, IHollis, JMLargent, BLHartig, PRHollis, GFMeunier, PCRobichaud, AJRobertson, DW Possible role of valvular serotonin 5-HT(2B) receptors in the cardiopathy associated with fenfluramine. Mol Pharmacol57:75-81 (2000) 5-hydroxytryptamine receptor 2B
Name:5-hydroxytryptamine receptor 2B
Type:G Protein-Coupled Receptor (GPCR)
Mol. Mass.:54312.47
Organism:Homo sapiens (Human)
Description:Receptor binding assays were performed using human clone stably expressed in CHO cells.
Residue:481
BDBM85598
NameBDBM85598
Synonyms:l-norfenfluramine
TypeSmall organic molecule
Emp. Form.C10H12F3N
Mol. Mass.203.2042
SMILESC[C@@H](N)Cc1cccc(c1)C(F)(F)F