Reaction Details
TargetHematopoietic prostaglandin D synthase
LigandBDBM85179
Substrate/Competitorn/a
Ki 1340±n/a nM
CommentsPDSP_518
Citation Abramovitz, MAdam, MBoie, YCarrière, MDenis, DGodbout, CLamontagne, SRochette, CSawyer, NTremblay, NMBelley, MGallant, MDufresne, CGareau, YRuel, RJuteau, HLabelle, MOuimet, NMetters, KM The utilization of recombinant prostanoid receptors to determine the affinities and selectivities of prostaglandins and related analogs. Biochim Biophys Acta1483:285-93 (2000) 
 
Hematopoietic prostaglandin D synthase
Name:Hematopoietic prostaglandin D synthase
Type:Enzyme
Mol. Mass.:23341.07
Organism:Homo sapiens (Human)
Description:The protein was expressed in E. coli strain BL21(DE3) with an N-terminal 6-His tag.
Residue:199
BDBM85179
NameBDBM85179
Synonyms:CAS_94079-80-8 NSC_72023
TypeSmall organic molecule
Emp. Form.C22H30O5
Mol. Mass.374.4706
SMILESCCC#CCC(C)C(O)C#CC1C(O)CC2CC(CC12)=CCOCC(O)=O