Reaction Details
TargetHematopoietic prostaglandin D synthase
LigandBDBM50150899
Substrate/Competitorn/a
Ki>10000±n/a nM
CommentsPDSP_4304
Citation Abramovitz, MAdam, MBoie, YCarrière, MDenis, DGodbout, CLamontagne, SRochette, CSawyer, NTremblay, NMBelley, MGallant, MDufresne, CGareau, YRuel, RJuteau, HLabelle, MOuimet, NMetters, KM The utilization of recombinant prostanoid receptors to determine the affinities and selectivities of prostaglandins and related analogs. Biochim Biophys Acta1483:285-93 (2000) 
 
Hematopoietic prostaglandin D synthase
Name:Hematopoietic prostaglandin D synthase
Type:Enzyme
Mol. Mass.:23341.07
Organism:Homo sapiens (Human)
Description:The protein was expressed in E. coli strain BL21(DE3) with an N-terminal 6-His tag.
Residue:199
BDBM50150899
NameBDBM50150899
Synonyms:(E)-7-[(1R,2R,3R,5S)-3,5-Dihydroxy-2-((R)-3-hydroxy-5-phenyl-pentyl)-cyclopentyl]-hept-5-enoic acid isopropyl ester LATANOPROST (PHXA41) | Latanoprost (Isopropyl Ester)
TypeSmall organic molecule
Emp. Form.C26H40O5
Mol. Mass.432.5928
SMILESCC(C)OC(=O)CCC\C=C\C[C@H]1[C@@H](O)C[C@@H](O)[C@@H]1CC[C@@H](O)CCc1ccccc1