Reaction Details
TargetHematopoietic prostaglandin D synthase
LigandBDBM85600
Substrate/Competitorn/a
Ki>10000±n/a nM
CommentsPDSP_4310
Citation Abramovitz, MAdam, MBoie, YCarrière, MDenis, DGodbout, CLamontagne, SRochette, CSawyer, NTremblay, NMBelley, MGallant, MDufresne, CGareau, YRuel, RJuteau, HLabelle, MOuimet, NMetters, KM The utilization of recombinant prostanoid receptors to determine the affinities and selectivities of prostaglandins and related analogs. Biochim Biophys Acta1483:285-93 (2000) 
 
Hematopoietic prostaglandin D synthase
Name:Hematopoietic prostaglandin D synthase
Type:Enzyme
Mol. Mass.:23341.07
Organism:Homo sapiens (Human)
Description:The protein was expressed in E. coli strain BL21(DE3) with an N-terminal 6-His tag.
Residue:199
BDBM85600
NameBDBM85600
Synonyms:CAS_146033-02-5 NSC_132748 | SC-51089
TypeSmall organic molecule
Emp. Form.C22H19ClN4O3
Mol. Mass.422.864
SMILESClc1ccc2Oc3ccccc3CN(C(=O)NNC(=O)CCc3ccncc3)c2c1