Reaction Details
TargetHematopoietic prostaglandin D synthase
LigandBDBM85603
Substrate/Competitorn/a
Ki 0.3±n/a nM
CommentsPDSP_4312
Citation Abramovitz, MAdam, MBoie, YCarrière, MDenis, DGodbout, CLamontagne, SRochette, CSawyer, NTremblay, NMBelley, MGallant, MDufresne, CGareau, YRuel, RJuteau, HLabelle, MOuimet, NMetters, KM The utilization of recombinant prostanoid receptors to determine the affinities and selectivities of prostaglandins and related analogs. Biochim Biophys Acta1483:285-93 (2000) 
 
Hematopoietic prostaglandin D synthase
Name:Hematopoietic prostaglandin D synthase
Type:Enzyme
Mol. Mass.:23341.07
Organism:Homo sapiens (Human)
Description:The protein was expressed in E. coli strain BL21(DE3) with an N-terminal 6-His tag.
Residue:199
BDBM85603
NameBDBM85603
Synonyms:CAS_5311503 ZK110841
TypeSmall organic molecule
Emp. Form.C21H33ClO4
Mol. Mass.384.937
SMILESOC(C=CC1C(O)CC(Cl)C1CC=CCCCC(O)=O)C1CCCCC1