Reaction Details
TargetProstaglandin E2 receptor EP1 subtype
LigandBDBM85601
Substrate/Competitorn/a
Ki>10000±n/a nM
CommentsPDSP_4313
Citation Abramovitz, MAdam, MBoie, YCarrière, MDenis, DGodbout, CLamontagne, SRochette, CSawyer, NTremblay, NMBelley, MGallant, MDufresne, CGareau, YRuel, RJuteau, HLabelle, MOuimet, NMetters, KM The utilization of recombinant prostanoid receptors to determine the affinities and selectivities of prostaglandins and related analogs. Biochim Biophys Acta1483:285-93 (2000) 
 
Prostaglandin E2 receptor EP1 subtype
Name:Prostaglandin E2 receptor EP1 subtype
Type:Enzyme
Mol. Mass.:41834.57
Organism:Homo sapiens (Human)
Description:P34995
Residue:402
BDBM85601
NameBDBM85601
Synonyms:AH-23848 CAS_54751 | NSC_54751
TypeSmall organic molecule
Emp. Form.C29H35NO5
Mol. Mass.477.5919
SMILESOC(=O)C(CC=C(CCC1CCC(=O)C1)OCc1ccc(cc1)-c1ccccc1)N1CCOCC1