Reaction Details
TargetProstaglandin E2 receptor EP1 subtype
LigandBDBM85183
Substrate/Competitorn/a
Ki 107±n/a nM
CommentsPDSP_1786
Citation Abramovitz, MAdam, MBoie, YCarrière, MDenis, DGodbout, CLamontagne, SRochette, CSawyer, NTremblay, NMBelley, MGallant, MDufresne, CGareau, YRuel, RJuteau, HLabelle, MOuimet, NMetters, KM The utilization of recombinant prostanoid receptors to determine the affinities and selectivities of prostaglandins and related analogs. Biochim Biophys Acta1483:285-93 (2000) 
 
Prostaglandin E2 receptor EP1 subtype
Name:Prostaglandin E2 receptor EP1 subtype
Type:Enzyme
Mol. Mass.:41834.57
Organism:Homo sapiens (Human)
Description:P34995
Residue:402
BDBM85183
NameBDBM85183
Synonyms:CAS_60325-46-4 SULPROSTONE
TypeSmall organic molecule
Emp. Form.C23H31NO7S
Mol. Mass.465.56
SMILESCS(=O)(=O)NC(=O)CCCC=CCC1C(C=CC(O)COc2ccccc2)C(O)CC1=O