Reaction Details
TargetProstaglandin E2 receptor EP2 subtype
LigandBDBM85606
Substrate/Competitorn/a
Ki 34±n/a nM
CommentsPDSP_4307
Citation Abramovitz, MAdam, MBoie, YCarrière, MDenis, DGodbout, CLamontagne, SRochette, CSawyer, NTremblay, NMBelley, MGallant, MDufresne, CGareau, YRuel, RJuteau, HLabelle, MOuimet, NMetters, KM The utilization of recombinant prostanoid receptors to determine the affinities and selectivities of prostaglandins and related analogs. Biochim Biophys Acta1483:285-93 (2000) 
 
Prostaglandin E2 receptor EP2 subtype
Name:Prostaglandin E2 receptor EP2 subtype
Type:Enzyme
Mol. Mass.:39775.71
Organism:Homo sapiens (Human)
Description:P43116
Residue:358
BDBM85606
NameBDBM85606
Synonyms:CAS_59122-46-2 | MISOPROSTOL (Free Acid)
TypeSmall organic molecule
Emp. Form.C22H38O5
Mol. Mass.382.5341
SMILESCCCCC(C)(O)C\C=C\[C@H]1[C@H](O)CC(=O)[C@@H]1CCCCCCC(=O)OC