Reaction Details
TargetProstaglandin E2 receptor EP2 subtype
LigandBDBM82213
Substrate/Competitorn/a
Ki 2973±n/a nM
CommentsPDSP_1458
Citation Abramovitz, MAdam, MBoie, YCarrière, MDenis, DGodbout, CLamontagne, SRochette, CSawyer, NTremblay, NMBelley, MGallant, MDufresne, CGareau, YRuel, RJuteau, HLabelle, MOuimet, NMetters, KM The utilization of recombinant prostanoid receptors to determine the affinities and selectivities of prostaglandins and related analogs. Biochim Biophys Acta1483:285-93 (2000) 
 
Prostaglandin E2 receptor EP2 subtype
Name:Prostaglandin E2 receptor EP2 subtype
Type:Enzyme
Mol. Mass.:39775.71
Organism:Homo sapiens (Human)
Description:P43116
Residue:358
BDBM82213
NameBDBM82213
Synonyms:CAS_41598-07-6 PGD2
TypeSmall organic molecule
Emp. Form.C20H30O4
Mol. Mass.334.4498
SMILESCCCCCC(O)CC=C1C(CC=CCCCC(O)=O)C=CC1=O