Reaction Details
TargetProstaglandin E2 receptor EP3 subtype
LigandBDBM50101824
Substrate/Competitorn/a
Ki>10000±n/a nM
CommentsPDSP_4306
Citation Abramovitz, MAdam, MBoie, YCarrière, MDenis, DGodbout, CLamontagne, SRochette, CSawyer, NTremblay, NMBelley, MGallant, MDufresne, CGareau, YRuel, RJuteau, HLabelle, MOuimet, NMetters, KM The utilization of recombinant prostanoid receptors to determine the affinities and selectivities of prostaglandins and related analogs. Biochim Biophys Acta1483:285-93 (2000) 
 
Prostaglandin E2 receptor EP3 subtype
Name:Prostaglandin E2 receptor EP3 subtype
Type:Enzyme
Mol. Mass.:43335.03
Organism:Homo sapiens (Human)
Description:P43115
Residue:390
BDBM50101824
NameBDBM50101824
Synonyms:7-{(1R,3R)-3-Hydroxy-2-[(E)-(S)-4-hydroxy-4-(1-propyl-cyclobutyl)-but-1-enyl]-5-oxo-cyclopentyl}-heptanoic acid methyl ester Butaprost (Methyl Ester) | CHEMBL432522
TypeSmall organic molecule
Emp. Form.C24H40O5
Mol. Mass.408.5714
SMILESCCCC1(CCC1)[C@@H](O)C\C=C\C1[C@H](O)CC(=O)[C@@H]1CCCCCCC(=O)OC