Reaction Details
TargetProstaglandin E2 receptor EP3 subtype
LigandBDBM85173
Substrate/Competitorn/a
Ki 708±n/a nM
CommentsPDSP_841
Citation Abramovitz, MAdam, MBoie, YCarrière, MDenis, DGodbout, CLamontagne, SRochette, CSawyer, NTremblay, NMBelley, MGallant, MDufresne, CGareau, YRuel, RJuteau, HLabelle, MOuimet, NMetters, KM The utilization of recombinant prostanoid receptors to determine the affinities and selectivities of prostaglandins and related analogs. Biochim Biophys Acta1483:285-93 (2000) 
 
Prostaglandin E2 receptor EP3 subtype
Name:Prostaglandin E2 receptor EP3 subtype
Type:Enzyme
Mol. Mass.:43335.03
Organism:Homo sapiens (Human)
Description:P43115
Residue:390
BDBM85173
NameBDBM85173
Synonyms:CAS_40666-16-8 NSC_5311100
TypeSmall organic molecule
Emp. Form.C23H29F3O6
Mol. Mass.458.468
SMILESOC(COc1cccc(c1)C(F)(F)F)C=CC1C(O)CC(O)C1CC=CCCCC(O)=O