Reaction Details
TargetProstaglandin E2 receptor EP4 subtype
LigandBDBM50008781
Substrate/Competitorn/a
Ki>10000±n/a nM
CommentsPDSP_1747
Citation Abramovitz, MAdam, MBoie, YCarrière, MDenis, DGodbout, CLamontagne, SRochette, CSawyer, NTremblay, NMBelley, MGallant, MDufresne, CGareau, YRuel, RJuteau, HLabelle, MOuimet, NMetters, KM The utilization of recombinant prostanoid receptors to determine the affinities and selectivities of prostaglandins and related analogs. Biochim Biophys Acta1483:285-93 (2000) 
 
Prostaglandin E2 receptor EP4 subtype
Name:Prostaglandin E2 receptor EP4 subtype
Type:Enzyme
Mol. Mass.:53134.53
Organism:Homo sapiens (Human)
Description:P35408
Residue:488
BDBM50008781
NameBDBM50008781
Synonyms:7-(3-(2-ethyl-N-phenylhydrazinecarboxamide)-7-oxa-bicyclo[2.2.1]hept-2-yl)-hept-5-enoic acid SQ 29548 | SQ-29548
TypeSmall organic molecule
Emp. Form.C21H29N3O4
Mol. Mass.387.4727
SMILESOC(=O)CCC\C=C/C[C@H]1[C@@H]2CCC(O2)[C@H]1CNNC(=O)Nc1ccccc1