Reaction Details
TargetProstaglandin F2-alpha receptor
LigandBDBM50109546
Substrate/Competitorn/a
Ki 427±n/a nM
CommentsPDSP_468
Citation Abramovitz, MAdam, MBoie, YCarrière, MDenis, DGodbout, CLamontagne, SRochette, CSawyer, NTremblay, NMBelley, MGallant, MDufresne, CGareau, YRuel, RJuteau, HLabelle, MOuimet, NMetters, KM The utilization of recombinant prostanoid receptors to determine the affinities and selectivities of prostaglandins and related analogs. Biochim Biophys Acta1483:285-93 (2000) 
 
Prostaglandin F2-alpha receptor
Name:Prostaglandin F2-alpha receptor
Type:Enzyme
Mol. Mass.:40072.29
Organism:Homo sapiens (Human)
Description:P43088
Residue:359
BDBM50109546
NameBDBM50109546
Synonyms:5-[(3aS,4R,5R,6aS)-5-Hydroxy-4-((S)-3-hydroxy-oct-1-enyl)-hexahydro-pentalen-(2Z)-ylidene]-pentanoic acid CARBACYCLIN PGI2
TypeSmall organic molecule
Emp. Form.C21H34O4
Mol. Mass.350.4923
SMILESCCCCC[C@H](O)\C=C\[C@H]1[C@H](O)C[C@@H]2C\C(C[C@H]12)=C\CCCC(O)=O