Reaction Details
TargetProstacyclin receptor
LigandBDBM85175
Substrate/Competitorn/a
Ki>10000±n/a nM
CommentsPDSP_453
Citation Abramovitz, MAdam, MBoie, YCarrière, MDenis, DGodbout, CLamontagne, SRochette, CSawyer, NTremblay, NMBelley, MGallant, MDufresne, CGareau, YRuel, RJuteau, HLabelle, MOuimet, NMetters, KM The utilization of recombinant prostanoid receptors to determine the affinities and selectivities of prostaglandins and related analogs. Biochim Biophys Acta1483:285-93 (2000) 
 
Prostacyclin receptor
Name:Prostacyclin receptor
Type:G Protein-Coupled Receptor (GPCR)
Mol. Mass.:40968.22
Organism:Homo sapiens (Human)
Description:The membranes prepared from human platelet were used in binding assay.
Residue:386
BDBM85175
NameBDBM85175
Synonyms:BW245C NSC_3080928
TypeSmall organic molecule
Emp. Form.C19H32N2O5
Mol. Mass.368.4678
SMILESOC(CCn1c(CCCCCCC(O)=O)c(O)[nH]c1=O)C1CCCCC1