Reaction Details
TargetProstacyclin receptor
LigandBDBM85183
Substrate/Competitorn/a
Ki>10000±n/a nM
CommentsPDSP_1786
Citation Abramovitz, MAdam, MBoie, YCarrière, MDenis, DGodbout, CLamontagne, SRochette, CSawyer, NTremblay, NMBelley, MGallant, MDufresne, CGareau, YRuel, RJuteau, HLabelle, MOuimet, NMetters, KM The utilization of recombinant prostanoid receptors to determine the affinities and selectivities of prostaglandins and related analogs. Biochim Biophys Acta1483:285-93 (2000) 
 
Prostacyclin receptor
Name:Prostacyclin receptor
Type:G Protein-Coupled Receptor (GPCR)
Mol. Mass.:40968.22
Organism:Homo sapiens (Human)
Description:The membranes prepared from human platelet were used in binding assay.
Residue:386
BDBM85183
NameBDBM85183
Synonyms:CAS_60325-46-4 SULPROSTONE
TypeSmall organic molecule
Emp. Form.C23H31NO7S
Mol. Mass.465.56
SMILESCS(=O)(=O)NC(=O)CCCC=CCC1C(C=CC(O)COc2ccccc2)C(O)CC1=O