Reaction Details
TargetSolute carrier organic anion transporter family member 2A1
LigandBDBM85601
Substrate/Competitorn/a
Ki 330±n/a nM
CommentsPDSP_4314
Citation Abramovitz, MAdam, MBoie, YCarrière, MDenis, DGodbout, CLamontagne, SRochette, CSawyer, NTremblay, NMBelley, MGallant, MDufresne, CGareau, YRuel, RJuteau, HLabelle, MOuimet, NMetters, KM The utilization of recombinant prostanoid receptors to determine the affinities and selectivities of prostaglandins and related analogs. Biochim Biophys Acta1483:285-93 (2000) 
 
Solute carrier organic anion transporter family member 2A1
Name:Solute carrier organic anion transporter family member 2A1
Type:Enzyme Catalytic Domain
Mol. Mass.:70068.67
Organism:Homo sapiens (Human)
Description:Prostaglandin Transporter 0 HUMAN::Q92959
Residue:643
BDBM85601
NameBDBM85601
Synonyms:AH-23848 CAS_54751 | NSC_54751
TypeSmall organic molecule
Emp. Form.C29H35NO5
Mol. Mass.477.5919
SMILESOC(=O)C(CC=C(CCC1CCC(=O)C1)OCc1ccc(cc1)-c1ccccc1)N1CCOCC1