Reaction Details
TargetSolute carrier organic anion transporter family member 2A1
LigandBDBM85602
Substrate/Competitorn/a
Ki>10000±n/a nM
CommentsPDSP_4305
Citation Abramovitz, MAdam, MBoie, YCarrière, MDenis, DGodbout, CLamontagne, SRochette, CSawyer, NTremblay, NMBelley, MGallant, MDufresne, CGareau, YRuel, RJuteau, HLabelle, MOuimet, NMetters, KM The utilization of recombinant prostanoid receptors to determine the affinities and selectivities of prostaglandins and related analogs. Biochim Biophys Acta1483:285-93 (2000) 
 
Solute carrier organic anion transporter family member 2A1
Name:Solute carrier organic anion transporter family member 2A1
Type:Enzyme Catalytic Domain
Mol. Mass.:70068.67
Organism:Homo sapiens (Human)
Description:Prostaglandin Transporter 0 HUMAN::Q92959
Residue:643
BDBM85602
NameBDBM85602
Synonyms:(R)-BUTAPROST CAS_69648-38-0
TypeSmall organic molecule
Emp. Form.C24H40O5
Mol. Mass.408.5714
SMILESCCCC1(CCC1)[C@H](O)C\C=C\[C@H]1[C@H](O)CC(=O)[C@@H]1CCCCCCC(=O)OC