Reaction Details
TargetSolute carrier organic anion transporter family member 2A1
LigandBDBM85177
Substrate/Competitorn/a
Ki 343±n/a nM
CommentsPDSP_1159
Citation Abramovitz, MAdam, MBoie, YCarrière, MDenis, DGodbout, CLamontagne, SRochette, CSawyer, NTremblay, NMBelley, MGallant, MDufresne, CGareau, YRuel, RJuteau, HLabelle, MOuimet, NMetters, KM The utilization of recombinant prostanoid receptors to determine the affinities and selectivities of prostaglandins and related analogs. Biochim Biophys Acta1483:285-93 (2000) 
 
Solute carrier organic anion transporter family member 2A1
Name:Solute carrier organic anion transporter family member 2A1
Type:Enzyme Catalytic Domain
Mol. Mass.:70068.67
Organism:Homo sapiens (Human)
Description:Prostaglandin Transporter 0 HUMAN::Q92959
Residue:643
BDBM85177
NameBDBM85177
Synonyms:CAS_80558-61-8 NSC_119139
TypeSmall organic molecule
Emp. Form.C22H30O5
Mol. Mass.374.4706
SMILESOC(COc1ccccc1)C=CC1CCC(=O)C1CCCCCCC(O)=O