Reaction Details
Target5-hydroxytryptamine receptor 4
LigandBDBM50122872
Substrate/Competitorn/a
Ki 63.09±n/a nM
CommentsPDSP_1544
Citation Bender, EPindon, Avan Oers, IZhang, YBGommeren, WVerhasselt, PJurzak, MLeysen, JLuyten, W Structure of the human serotonin 5-HT4 receptor gene and cloning of a novel 5-HT4 splice variant. J Neurochem74:478-89 (2000) 
 
5-hydroxytryptamine receptor 4
Name:5-hydroxytryptamine receptor 4
Type:Enzyme
Mol. Mass.:43767.54
Organism:Homo sapiens (Human)
Description:Q13639
Residue:388
BDBM50122872
NameBDBM50122872
Synonyms:4-Amino-5-chloro-2,3-dihydro-benzofuran-7-carboxylic acid [1-(3-methoxy-propyl)-piperidin-4-yl]-amide PRUCALOPRIDE | US9663465, prucalopride
TypeSmall organic molecule
Emp. Form.C18H26ClN3O3
Mol. Mass.367.87
SMILESCOCCCN1CCC(CC1)NC(=O)c1cc(Cl)c(N)c2CCOc12