Reaction Details
Target5-hydroxytryptamine receptor 4
LigandBDBM85607
Substrate/Competitorn/a
Ki 10±n/a nM
CommentsPDSP_1699
Citation Bender, EPindon, Avan Oers, IZhang, YBGommeren, WVerhasselt, PJurzak, MLeysen, JLuyten, W Structure of the human serotonin 5-HT4 receptor gene and cloning of a novel 5-HT4 splice variant. J Neurochem74:478-89 (2000) 
 
5-hydroxytryptamine receptor 4
Name:5-hydroxytryptamine receptor 4
Type:Enzyme
Mol. Mass.:43767.54
Organism:Homo sapiens (Human)
Description:Q13639
Residue:388
BDBM85607
NameBDBM85607
Synonyms:CAS_189188-57-6 SDZ-HTF919
TypeSmall organic molecule
Emp. Form.C15H21N5O2
Mol. Mass.303.3595
SMILESCOc1ccc2[nH]cc(C=NN=C(N)NCCCCO)c2c1