Reaction Details
Target5-hydroxytryptamine receptor 2A
LigandBDBM85608
Substrate/Competitorn/a
Ki 1000±n/a nM
CommentsPDSP_3799
Citation Lovell, PJBromidge, SMDabbs, SDuckworth, DMForbes, ITJennings, AJKing, FDMiddlemiss, DNRahman, SKSaunders, DVCollin, LLHagan, JJRiley, GJThomas, DR A novel, potent, and selective 5-HT(7) antagonist: (R)-3-(2-(2-(4-methylpiperidin-1-yl)ethyl)pyrrolidine-1-sulfonyl) phen ol (SB-269970). J Med Chem43:342-5 (2000) 
 
5-hydroxytryptamine receptor 2A
Name:5-hydroxytryptamine receptor 2A
Type:undefined
Mol. Mass.:52607.65
Organism:Homo sapiens (Human)
Description:P28223
Residue:471
BDBM85608
NameBDBM85608
Synonyms:(R)-1-(2-(1-(3,4-Dichloro-benzene sulfonyl)-pyrrolidin-2-yl)-ethyl)-4-methyl piperidine
TypeSmall organic molecule
Emp. Form.C18H26Cl2N2O2S
Mol. Mass.405.382
SMILES[#6]-[#6]-1-[#6]-[#6]-[#7](-[#6]-[#6]-[#6@H]-2-[#6]-[#6]-[#6]-[#7]-2[S;v6](=O)(=O)c2ccc(Cl)c(Cl)c2)-[#6]-[#6]-1