Reaction Details
Target5-hydroxytryptamine receptor 2A
LigandBDBM50130278
Substrate/Competitorn/a
Ki 1584.89±n/a nM
CommentsPDSP_3798
Citation Lovell, PJBromidge, SMDabbs, SDuckworth, DMForbes, ITJennings, AJKing, FDMiddlemiss, DNRahman, SKSaunders, DVCollin, LLHagan, JJRiley, GJThomas, DR A novel, potent, and selective 5-HT(7) antagonist: (R)-3-(2-(2-(4-methylpiperidin-1-yl)ethyl)pyrrolidine-1-sulfonyl) phen ol (SB-269970). J Med Chem43:342-5 (2000) 
 
5-hydroxytryptamine receptor 2A
Name:5-hydroxytryptamine receptor 2A
Type:undefined
Mol. Mass.:52607.65
Organism:Homo sapiens (Human)
Description:P28223
Residue:471
BDBM50130278
NameBDBM50130278
Synonyms:(R)-4-Methyl-1-(2-(1-(naphthalene-1-sulfonyl)-pyrrolidin-2-yl)-ethyl)-piperidine(10) 4-Methyl-1-{2-[(R)-1-(naphthalene-1-sulfonyl)-pyrrolidin-2-yl]-ethyl}-piperidine | CHEMBL94984
TypeSmall organic molecule
Emp. Form.C22H30N2O2S
Mol. Mass.386.551
SMILESCC1CCN(CC[C@H]2CCCN2S(=O)(=O)c2cccc3ccccc23)CC1