Reaction Details
Target5-hydroxytryptamine receptor 7
LigandBDBM85610
Substrate/Competitorn/a
Ki 2.00±n/a nM
CommentsPDSP_3800
Citation Lovell, PJBromidge, SMDabbs, SDuckworth, DMForbes, ITJennings, AJKing, FDMiddlemiss, DNRahman, SKSaunders, DVCollin, LLHagan, JJRiley, GJThomas, DR A novel, potent, and selective 5-HT(7) antagonist: (R)-3-(2-(2-(4-methylpiperidin-1-yl)ethyl)pyrrolidine-1-sulfonyl) phen ol (SB-269970). J Med Chem43:342-5 (2000) 
 
5-hydroxytryptamine receptor 7
Name:5-hydroxytryptamine receptor 7
Type:G Protein-Coupled Receptor (GPCR)
Mol. Mass.:53573.08
Organism:Homo sapiens (Human)
Description:P34969
Residue:479
BDBM85610
NameBDBM85610
Synonyms:(R)-1-(2-(1-(3-bromo-benzenesulfonyl)-pyrrolidin-2-yl)-ethyl)-4-methyl piperidine
TypeSmall organic molecule
Emp. Form.C18H27BrN2O2S
Mol. Mass.415.388
SMILES[#6]-[#6]-1-[#6]-[#6]-[#7](-[#6]-[#6]-[#6@H]-2-[#6]-[#6]-[#6]-[#7]-2[S;v6](=O)(=O)c2cccc(Br)c2)-[#6]-[#6]-1