Reaction Details
Target5-hydroxytryptamine receptor 7
LigandBDBM85609
Substrate/Competitorn/a
Ki 10±n/a nM
CommentsPDSP_3801
Citation Lovell, PJBromidge, SMDabbs, SDuckworth, DMForbes, ITJennings, AJKing, FDMiddlemiss, DNRahman, SKSaunders, DVCollin, LLHagan, JJRiley, GJThomas, DR A novel, potent, and selective 5-HT(7) antagonist: (R)-3-(2-(2-(4-methylpiperidin-1-yl)ethyl)pyrrolidine-1-sulfonyl) phen ol (SB-269970). J Med Chem43:342-5 (2000) 
 
5-hydroxytryptamine receptor 7
Name:5-hydroxytryptamine receptor 7
Type:G Protein-Coupled Receptor (GPCR)
Mol. Mass.:53573.08
Organism:Homo sapiens (Human)
Description:P34969
Residue:479
BDBM85609
NameBDBM85609
Synonyms:(R)-1-(2-(1-(3-methoxy-benzenesulfonyl)-pyrrolidin-2-yl)-ethyl-4-methyl piperidine
TypeSmall organic molecule
Emp. Form.C19H30N2O3S
Mol. Mass.366.518
SMILES[#6]-[#8]-c1cccc(c1)[S;v6](=O)(=O)[#7]-1-[#6]-[#6]-[#6]-[#6@@H]-1-[#6]-[#6]-[#7]-1-[#6]-[#6]-[#6](-[#6])-[#6]-[#6]-1