Reaction Details
TargetD(3) dopamine receptor
LigandBDBM85610
Substrate/Competitorn/a
Ki 630.96±n/a nM
CommentsPDSP_3800
Citation Lovell, PJBromidge, SMDabbs, SDuckworth, DMForbes, ITJennings, AJKing, FDMiddlemiss, DNRahman, SKSaunders, DVCollin, LLHagan, JJRiley, GJThomas, DR A novel, potent, and selective 5-HT(7) antagonist: (R)-3-(2-(2-(4-methylpiperidin-1-yl)ethyl)pyrrolidine-1-sulfonyl) phen ol (SB-269970). J Med Chem43:342-5 (2000) 
 
D(3) dopamine receptor
Name:D(3) dopamine receptor
Type:n/a
Mol. Mass.:44243.43
Organism:Homo sapiens (Human)
Description:n/a
Residue:400
BDBM85610
NameBDBM85610
Synonyms:(R)-1-(2-(1-(3-bromo-benzenesulfonyl)-pyrrolidin-2-yl)-ethyl)-4-methyl piperidine
TypeSmall organic molecule
Emp. Form.C18H27BrN2O2S
Mol. Mass.415.388
SMILES[#6]-[#6]-1-[#6]-[#6]-[#7](-[#6]-[#6]-[#6@H]-2-[#6]-[#6]-[#6]-[#7]-2[S;v6](=O)(=O)c2cccc(Br)c2)-[#6]-[#6]-1