Reaction Details
TargetD(3) dopamine receptor
LigandBDBM50098551
Substrate/Competitorn/a
Ki 2511.89±n/a nM
CommentsPDSP_3688
Citation Lovell, PJBromidge, SMDabbs, SDuckworth, DMForbes, ITJennings, AJKing, FDMiddlemiss, DNRahman, SKSaunders, DVCollin, LLHagan, JJRiley, GJThomas, DR A novel, potent, and selective 5-HT(7) antagonist: (R)-3-(2-(2-(4-methylpiperidin-1-yl)ethyl)pyrrolidine-1-sulfonyl) phen ol (SB-269970). J Med Chem43:342-5 (2000) 
 
D(3) dopamine receptor
Name:D(3) dopamine receptor
Type:n/a
Mol. Mass.:44243.43
Organism:Homo sapiens (Human)
Description:n/a
Residue:400
BDBM50098551
NameBDBM50098551
Synonyms:(R)-3-(2-(2-(4-methylpiperidin-1-yl)ethyl)pyrrolidin-1-ylsulfonyl)phenol 3-{(R)-2-[2-(4-Methyl-piperidin-1-yl)-ethyl]-pyrrolidine-1-sulfonyl}-phenol 3-{2-[2-(4-Methyl-piperidin-1-yl)-ethyl]-pyrrolidine-1-sulfonyl}-phenol CHEMBL282199 | SB-269970
TypeSmall organic molecule
Emp. Form.C18H28N2O3S
Mol. Mass.352.492
SMILESCC1CCN(CC[C@H]2CCCN2S(=O)(=O)c2cccc(O)c2)CC1