Reaction Details
TargetIsoform 2 of Histone lysine demethylase PHF8 (2)
LigandBDBM276042
Substrate/Competitorn/a
Meas. Tech.PHF8 Assay
Temperature298.15±n/a K
IC50 5500±n/a nM
Commentsextracted
Citation Chen, YKNie, ZStafford, JAVeal, JM Histone demethylase inhibitors US Patent US10071984 Publication Date 9/11/2018
 
Isoform 2 of Histone lysine demethylase PHF8 (2)
Name:Isoform 2 of Histone lysine demethylase PHF8 (2)
Type:Enzyme Catalytic Domain
Mol. Mass.:113932.27
Organism:Homo sapiens (Human)
Description:Q9UPP1-2
Residue:1024
BDBM276042
NameBDBM276042
Synonyms:2-[5-[2-(cyclopropylmethoxy)-4-fluorophenyl]-1-methylimidazol-4-yl]-4-(1H-triazol-4-yl)pyridine US10174003, Example 4 | US9896436, Example 4
TypeSmall organic molecule
Emp. Form.C21H19FN6O
Mol. Mass.390.4136
SMILESCn1cnc(c1-c1ccc(F)cc1OCC1CC1)-c1cc(ccn1)-c1c[nH]nn1