Reaction Details
TargetIsoform 2 of Histone lysine demethylase PHF8 (2)
LigandBDBM276043
Substrate/Competitorn/a
Meas. Tech.PHF8 Assay
Temperature298.15±n/a K
IC50 550±n/a nM
Commentsextracted
Citation Chen, YKNie, ZStafford, JAVeal, JM Histone demethylase inhibitors US Patent US10071984 Publication Date 9/11/2018
 
Isoform 2 of Histone lysine demethylase PHF8 (2)
Name:Isoform 2 of Histone lysine demethylase PHF8 (2)
Type:Enzyme Catalytic Domain
Mol. Mass.:113932.27
Organism:Homo sapiens (Human)
Description:Q9UPP1-2
Residue:1024
BDBM276043
NameBDBM276043
Synonyms:2-[1-(1-phenylethyl)imidazol-4-yl]-4-(1H-triazol-4-yl)pyridine US10174003, Example 5 | US9896436, Example 5
TypeSmall organic molecule
Emp. Form.C18H16N6
Mol. Mass.316.3598
SMILESCC(c1ccccc1)n1cnc(c1)-c1cc(ccn1)-c1c[nH]nn1