Reaction Details
TargetLysine-specific demethylase 2B
LigandBDBM276045
Substrate/Competitorn/a
Meas. Tech.FBXL10 Assay
Temperature298.15±n/a K
IC50<100±n/a nM
Commentsextracted
Citation Chen, YKNie, ZStafford, JAVeal, JM Histone demethylase inhibitors US Patent US10071984 Publication Date 9/11/2018
 
Lysine-specific demethylase 2B
Name:Lysine-specific demethylase 2B
Type:Enzyme Catalytic Domain
Mol. Mass.:152658.35
Organism:Homo sapiens (Human)
Description:Q8NHM5
Residue:1336
BDBM276045
NameBDBM276045
Synonyms:2-[1-[2-(2-methoxyphenyl)ethyl]imidazol-4-yl]-4-(1H-triazol-4-yl)pyridine US10174003, Example 7 | US9896436, Example 7
TypeSmall organic molecule
Emp. Form.C19H18N6O
Mol. Mass.346.3858
SMILESCOc1ccccc1CCn1cnc(c1)-c1cc(ccn1)-c1c[nH]nn1