Reaction Details
TargetIsoform 2 of Histone lysine demethylase PHF8 (2)
LigandBDBM276053
Substrate/Competitorn/a
Meas. Tech.PHF8 Assay
Temperature298.15±n/a K
IC50 550±n/a nM
Commentsextracted
Citation Chen, YKNie, ZStafford, JAVeal, JM Histone demethylase inhibitors US Patent US10071984 Publication Date 9/11/2018
 
Isoform 2 of Histone lysine demethylase PHF8 (2)
Name:Isoform 2 of Histone lysine demethylase PHF8 (2)
Type:Enzyme Catalytic Domain
Mol. Mass.:113932.27
Organism:Homo sapiens (Human)
Description:Q9UPP1-2
Residue:1024
BDBM276053
NameBDBM276053
Synonyms:4-[2-[1-(1,2,3,4-tetrahydronaphthalen-1-ylmethyl)imidazol-4-yl]pyridin-4-yl]-1H-triazole-5-carbonitrile US9896436, Example 15
TypeSmall organic molecule
Emp. Form.C22H19N7
Mol. Mass.381.4332
SMILESN#Cc1[nH]nnc1-c1ccnc(c1)-c1cn(CC2CCCc3ccccc23)cn1