Reaction Details
TargetIsoform 2 of Histone lysine demethylase PHF8 (2)
LigandBDBM276058
Substrate/Competitorn/a
Meas. Tech.PHF8 Assay
Temperature298.15±n/a K
IC50 550±n/a nM
Commentsextracted
Citation Chen, YKNie, ZStafford, JAVeal, JM Histone demethylase inhibitors US Patent US10071984 Publication Date 9/11/2018
 
Isoform 2 of Histone lysine demethylase PHF8 (2)
Name:Isoform 2 of Histone lysine demethylase PHF8 (2)
Type:Enzyme Catalytic Domain
Mol. Mass.:113932.27
Organism:Homo sapiens (Human)
Description:Q9UPP1-2
Residue:1024
BDBM276058
NameBDBM276058
Synonyms:2-[1-[(2,3-dichlorophenyl)methyl]imidazol-4-yl]-4-(5-fluoro-1H-triazol-4-yl)pyridine US10174003, Example 20 | US9896436, Example 20
TypeSmall organic molecule
Emp. Form.C17H11Cl2FN6
Mol. Mass.389.214
SMILESFc1[nH]nnc1-c1ccnc(c1)-c1cn(Cc2cccc(Cl)c2Cl)cn1