Reaction Details
TargetLysine-specific demethylase 2B
LigandBDBM276059
Substrate/Competitorn/a
Meas. Tech.FBXL10 Assay
Temperature298.15±n/a K
IC50<100±n/a nM
Commentsextracted
Citation Chen, YKNie, ZStafford, JAVeal, JM Histone demethylase inhibitors US Patent US10071984 Publication Date 9/11/2018
 
Lysine-specific demethylase 2B
Name:Lysine-specific demethylase 2B
Type:Enzyme Catalytic Domain
Mol. Mass.:152658.35
Organism:Homo sapiens (Human)
Description:Q8NHM5
Residue:1336
BDBM276059
NameBDBM276059
Synonyms:2-[1-[(2,3-dichlorophenyl)methyl]imidazol-4-yl]-4-(1H-triazol-4-yl)pyridine US10174003, Example 21 | US9896436, Example 21
TypeSmall organic molecule
Emp. Form.C17H12Cl2N6
Mol. Mass.371.223
SMILESClc1cccc(Cn2cnc(c2)-c2cc(ccn2)-c2c[nH]nn2)c1Cl