Reaction Details
TargetLysine-specific demethylase 2B
LigandBDBM276068
Substrate/Competitorn/a
Meas. Tech.FBXL10 Assay
Temperature298.15±n/a K
IC50<100±n/a nM
Commentsextracted
Citation Chen, YKNie, ZStafford, JAVeal, JM Histone demethylase inhibitors US Patent US10071984 Publication Date 9/11/2018
 
Lysine-specific demethylase 2B
Name:Lysine-specific demethylase 2B
Type:Enzyme Catalytic Domain
Mol. Mass.:152658.35
Organism:Homo sapiens (Human)
Description:Q8NHM5
Residue:1336
BDBM276068
NameBDBM276068
Synonyms:2-[1-[(2-fluoro-3-methoxyphenyl)methyl]imidazol-4-yl]-4-(1H-triazol-4-yl)pyridine US10174003, Example 30 | US9896436, Example 30
TypeSmall organic molecule
Emp. Form.C18H15FN6O
Mol. Mass.350.3497
SMILESCOc1cccc(Cn2cnc(c2)-c2cc(ccn2)-c2c[nH]nn2)c1F