Reaction Details
TargetIsoform 2 of Histone lysine demethylase PHF8 (2)
LigandBDBM276073
Substrate/Competitorn/a
Meas. Tech.PHF8 Assay
Temperature298.15±n/a K
IC50 550±n/a nM
Commentsextracted
Citation Chen, YKNie, ZStafford, JAVeal, JM Histone demethylase inhibitors US Patent US10071984 Publication Date 9/11/2018
 
Isoform 2 of Histone lysine demethylase PHF8 (2)
Name:Isoform 2 of Histone lysine demethylase PHF8 (2)
Type:Enzyme Catalytic Domain
Mol. Mass.:113932.27
Organism:Homo sapiens (Human)
Description:Q9UPP1-2
Residue:1024
BDBM276073
NameBDBM276073
Synonyms:4-(5-fluoro-1H-triazol-4-yl)-2-[1-(2-naphthalen-1-ylethyl)imidazol-4-yl]pyridine US10174003, Example 35 | US9896436, Example 35
TypeSmall organic molecule
Emp. Form.C22H17FN6
Mol. Mass.384.409
SMILESFc1[nH]nnc1-c1ccnc(c1)-c1cn(CCc2cccc3ccccc23)cn1