Reaction Details
TargetLysine-specific demethylase 2B
LigandBDBM276079
Substrate/Competitorn/a
Meas. Tech.FBXL10 Assay
Temperature298.15±n/a K
IC50<100±n/a nM
Commentsextracted
Citation Chen, YKNie, ZStafford, JAVeal, JM Histone demethylase inhibitors US Patent US10071984 Publication Date 9/11/2018
 
Lysine-specific demethylase 2B
Name:Lysine-specific demethylase 2B
Type:Enzyme Catalytic Domain
Mol. Mass.:152658.35
Organism:Homo sapiens (Human)
Description:Q8NHM5
Residue:1336
BDBM276079
NameBDBM276079
Synonyms:2-[5-[2-(cyclopropylmethoxy)-4-fluorophenyl]-1-methylimidazol-4-yl]-4-(5-fluoro-1H-triazol-4-yl)pyridine US10174003, Example 41 | US9896436, Example 41
TypeSmall organic molecule
Emp. Form.C21H18F2N6O
Mol. Mass.408.404
SMILESCn1cnc(c1-c1ccc(F)cc1OCC1CC1)-c1cc(ccn1)-c1nn[nH]c1F