Reaction Details
TargetIsoform 2 of Histone lysine demethylase PHF8 (2)
LigandBDBM276081
Substrate/Competitorn/a
Meas. Tech.PHF8 Assay
Temperature298.15±n/a K
IC50 5500±n/a nM
Commentsextracted
Citation Chen, YKNie, ZStafford, JAVeal, JM Histone demethylase inhibitors US Patent US10071984 Publication Date 9/11/2018
 
Isoform 2 of Histone lysine demethylase PHF8 (2)
Name:Isoform 2 of Histone lysine demethylase PHF8 (2)
Type:Enzyme Catalytic Domain
Mol. Mass.:113932.27
Organism:Homo sapiens (Human)
Description:Q9UPP1-2
Residue:1024
BDBM276081
NameBDBM276081
Synonyms:4-{1H-[1,2,3]triazolo[4,5-c]pyridin-6-yl}-1-(2,2,2-trifluoroethyl)-1H-imidazole US10174003, Example 43 | US9896436, Example 43
TypeSmall organic molecule
Emp. Form.C10H7F3N6
Mol. Mass.268.198
SMILESFC(F)(F)Cn1cnc(c1)-c1cc2[nH]nnc2cn1