Reaction Details
TargetLysine-specific demethylase 2B
LigandBDBM276082
Substrate/Competitorn/a
Meas. Tech.FBXL10 Assay
Temperature298.15±n/a K
IC50<100±n/a nM
Commentsextracted
Citation Chen, YKNie, ZStafford, JAVeal, JM Histone demethylase inhibitors US Patent US10071984 Publication Date 9/11/2018
 
Lysine-specific demethylase 2B
Name:Lysine-specific demethylase 2B
Type:Enzyme Catalytic Domain
Mol. Mass.:152658.35
Organism:Homo sapiens (Human)
Description:Q8NHM5
Residue:1336
BDBM276082
NameBDBM276082
Synonyms:1-benzyl-4-{1H-[1,2,3]triazolo[4,5-c]pyridin-6-yl}-1H-imidazole US10174003, Example 44 | US9896436, Example 44
TypeSmall organic molecule
Emp. Form.C15H12N6
Mol. Mass.276.296
SMILESC(c1ccccc1)n1cnc(c1)-c1cc2[nH]nnc2cn1