Reaction Details
TargetLysine-specific demethylase 2B
LigandBDBM276084
Substrate/Competitorn/a
Meas. Tech.FBXL10 Assay
Temperature298.15±n/a K
IC50<100±n/a nM
Commentsextracted
Citation Chen, YKNie, ZStafford, JAVeal, JM Histone demethylase inhibitors US Patent US10071984 Publication Date 9/11/2018
 
Lysine-specific demethylase 2B
Name:Lysine-specific demethylase 2B
Type:Enzyme Catalytic Domain
Mol. Mass.:152658.35
Organism:Homo sapiens (Human)
Description:Q8NHM5
Residue:1336
BDBM276084
NameBDBM276084
Synonyms:1-[(3-chlorophenyl)methyl]-4-{1H-[1,2,3]triazolo[4,5-c]pyridin-6-yl}-1H-imidazole US10174003, Example 46 | US9896436, Example 46
TypeSmall organic molecule
Emp. Form.C15H11ClN6
Mol. Mass.310.741
SMILESClc1cccc(Cn2cnc(c2)-c2cc3[nH]nnc3cn2)c1